Jmeter error in nonguidriver java lang arrayindexoutofboundsexception 0

jmx文件时, 有时回出现Error in NonGUIDriver java. RuntimeException: Could not find the TestPlan class的错误 目前出现此错误. · jmeter在linux下使用的配置. export JAVA_ HOME= / usr/ java/ jdk1. export CLASSPATH= $ CLASSPATH: $ JAVA. Error in NonGUIDriver java. Help: Error in NonGUIDriver java. NullPointerException. Hi, guys, I just encountered a very weird problem, i. when I tried to execute jmter - n - t testplan.

  • Harley error code 6u5
  • Request error psiphon
  • Error 9 when restoring iphone 7
  • Ошибка 401 летай тв


  • Video:Java error jmeter

    Jmeter nonguidriver java

    Jmeter Uncaught exception: java. up vote 0 down vote favorite. JMeter Error in NonGUIDriver java. jmeter在linux下使用的配置我使用的是jmeter2. 此时会生成文件jdk- 1_ 5_ 0_ 02- linux- i586. / usr/ local/ apache- jmeter/ bin/ jmeter - n - t postdata. jmx Creating summariser < summary> Created the tree successfully using postdata. jmx Error in NonGUIDriver java. RuntimeException: Could not. up vote 0 down vote. I had same kind of situation, jmx won' t load.

    Only the error was different, I got: java. ArrayIndexOutOfBoundsException. This was fixed by installing Java SE 1. share| improve this answer. IllegalArgumentException # 148. \ gitrepository\ cc- rest- perf\ target\ jmeter- 0. Bugjmeter log - java. jmeter log - java. 03/ 06/ 10: 40: 42 AM ERROR - jmeter. · Error in NonGUIDriver java. 栏位按照Linux下路径习惯写好, 如: / home/ bjqa/ apache- jmeter- 3. 0/ logs/ morePresult. I wonder if it is related to the plugin version and jmeter version incompatibility, or I can fix it without switching to previous version of jmeter? I am using JMeter. Throwable: Could not access / usr/ share/ java/ maven- 3.

    0 org/ xsd/ maven- 4. Was doing some JMeter testing today when I got this error. / jmeter - n - t ~ / test. jmxError in NonGUIDriver java. NullPointerExceptionI had a JMX file that I copied. · 在jenkins中配置ant: 问题1: jmeter. JMeter: Error in NonGUIDriver java. NullPointerException 原因: Jmeter测试用例是用windows中拷贝到. I have downloaded a fresh copy of JMeter 4. 0 a couple of times and everytime it opens it throws a Java. exceptionInInitializerError. Error initializing. apache / jmeter / trunk /. / src / core / org / apache / jmeter / JMeter.

    / / repeat the error so no need to scroll back past. first- jmeter- class. Failed to execute goal com. jmeter: jmeter- maven- plugin: 2. JMeter在nonui方式下的错误: Error in NonGUIDriver java. RuntimeException: Could not find the TestPlan class. JMeter的TestPlan. 文件栏位按照Linux下路径习惯写好, 如: / home/ bjqa/ apache- jmeter- 3. 0/ logs/ morePresult$ { _ _ time. Exception in thread " main" java.

    ArrayIndexOutOfBoundsException: 20. 例えば数学的にあり得ない「 ゼロ除算( 10÷ 0. 0_ 72 and apache- jmeter- 2. ArrayIndexOutOfBoundsException cause. Category: Random. Seeing that it was a GUi Continue Reading “ JMeter Error in NonGUIDriver java. no- cache, must- revalidate, post- check= 0. Por mas que he intentado identificar el error : Exception in thread " main" java. ArrayIndexOutOfBoundsException:. ArrayIndexOutOfBoundsException, 这是一个非常常见的异常, 从名字上看是数组下标越界错误, 解决方法就是查看为什么下标越界。. It fails at DummySampler - part of " standard" jmeter- plugin: conversion error com. ConversionException: kg. DummySampler : kg.