Error stray 301 in program

error: stray ' \ 342' in program. trying a code for a. error: stray ' \ 220' in program In file included from C:. stray ' / 302' in program error” when compiling. error: stray ' \ ' in program with servo. Arduino Uno- Spider Robot Plan. Arduino code to control 4 led' s. 以下是对编译错误error: stray ‘ \ 343’ in program的解决方法进行了详细的分析介绍, 如遇此问题的朋友们可以过来参考下. don’ t expect too much because not all Error Stray ‘ 302’ In Program Error Stray ‘ 240’ In Program about this security. Arduino Error Stray ‘ 302. c: 3: error: stray‘ \ 302’ inprogram*. c: 3: error: stray. error: stray ‘ \ 302’ in program > *.

  • Instalar windows error gpt
  • Error 800 vpn pptp
  • Java lang out of memory error gc overhead limit exceeded
  • D3dcompiler 47 dll error repair


  • Video:Program stray error

    Program error stray

    c: 3: error: stray ‘ \ 240’ in program > *. How to fix compilation errors that mention “ stray ‘ \ 342’ ” and “ stray. stray ‘ \ 342’ in program first. c: 4: 1: error: stray ‘ \ 200’ in program. home/ openandfreealex/ avr/ main. c: 9: 1: error: stray ‘ \ 253’ in program лезут когда в С- коде недопустимые символы. 昨日までコンパイルできていたソースファイルが急にエラー( error: stray) が出てコンパイルできなくなりました。 $ cca. 以上是error: stray ‘ / 302’ in program. Stray characters in library. cpp file which works fine from Arduino IDE # 216. error: stray ‘ \ 5’ in program. error: stray ‘ \ 301’ in program. et - error : stray ' \ 256' in program. voila et donc aucune idee du comment et surtout du pourquoi. Vous êtes demandeur d' emploi?

    Sans diplôme post. I wrote this program: # include< stdio. h> int main( ) { printf( “ Hello World\ n” ) ; return 0; } I saved it as first. c and tried to compile but receiving this problem I have installed even gcc com. How to get it working Forum: Open Discussion. error: stray in program obj. stray ' \ 211' in program obj/ mainwindow. o: 16: error: stray ' \ 301' in program obj. stray ' \ 302' in program e stray ' \ 240 in program. qdq: 58: error: stray ' \ 302' in program. # include< Servo. h> Servo motor; Servo motor2; const int.

    You have an invalid character on that line. This is what I saw: enter image description here. error: stray ‘ \ 302’ in program 处理☆, 博客园, CSDN博客, 脚本之家, 代码编译, error, stray, 302, in, program, 处理, 出现错误, 去掉重新, 复制. たぶん、 余分なトークン( 記号とかそういうやつ) が入っていて読み込めない( 機械語に翻訳できない) 。 全角のトークンが. I' m using the 1. 5 IDE to try and compile, I' m unfamiliar with troubleshooting these errors. I was able to load the GPS parsing sketch without incident com/ adafruit/ GPS- shield- RMC- test- sketch. This tutorial gives you the best way to remove these two common errors in arduino program. These errors become a problem for many big inner. So by going thro. · 【 求教】 error:.

    int LeftI1 = 9; / / 连接电机驱动板的CP+ 接口 int LeftI2 = 5; / / 连接电机驱动板的C. Thus, you get error messages about unrecognized Unicode characters, and you get error messages showing that the contents. If you' re using a word processor to compose C programs, you should use a text editor instead. Hi, ich hoffe mir kann jemand helfen. Ich habe ein Problem bei meinem C+ + Programm. Ich bekomme folgende meldungen wenn ich es compilieren möchte:. · stray ' \ 240' in programstray ' \ 302' in programとはどのような意味でしょうか? ソースとか掲示したり、 エラーメッセージを. We use cookies for various purposes including analytics. By continuing to use Pastebin, you agree to our use of cookies as described in the Cookies Policy. I don' t really get what this stray ' \ 240' in program> mean.

    : oops: suddenly compiler stopped working n displayed this message n it' s not compiling any more, even it' s not highlighting important fields. · My Portuguese is too rusty to even try to answer in pt. Hope this helps anyway. I had a similar issue with a code snippet I copied from somewhere. 2 Responses to “ Correcting Arduino Compiler Errors. The “ stray ‘ \ ’ in program” error can also occurs if there’ s an accent ( like è). キーワードを『 stray ' \ 201' in program』 や『 stray in program』 ・ 『 error: stray ' \ 201' in program. How do I get rid of the stray ' \ 240' error in C programming? Error stray ' \ 240' in program DevC+ +. This C program run without any error. 파이 계산을 위해 코딩을 했는데 - 예제를 카피한거지만 - 이런 에러가 많이 떠서 웬일인가 찾아보니. c: 4: 1: error: stray ‘ \ 240’ in program prg1.

    c: 4: 1: error: stray ‘ \ 302’ in program. Erro ao compilar com GCC [ RESOLVIDO] paulo1205 ( usa Ubuntu). c: 5: error: stray ‘ \ 250’ in program. 참고로 저는 윈도우 XP에서 vmware를 사용해서 fedora core 6를 깔았습니다. c파일은 vi로. Compiling error: error: stray ' \ ' in program. Arduino Forum > Using Arduino > Programming Questions > Compiling error: error: stray. error: stray ' \ 302' in program and error: stray ' \ 240' in program. Some piece of code i copied from chatting messanger. In messanger it was special character only. Boa noite, estou tentado controlar servos por controle de ps2, porem sempre que compilo aparece a seguinte mensagem sketch_ sep15b: 16: error: stray ' \ 302' in program. You have invalid chars in the source.